Hello; when trying to install Bison 2.3, I get the following error message during the "make" process:
make[2]: Entering directory `/home/neptunenavigator2001/bison-2.3/po'
test -z "da.gmo de.gmo es.gmo et.gmo fr.gmo ga.gmo hr.gmo id.gmo it.gmo ja.gmo ms.gmo nb.gmo nl.gmo pl.gmo pt_BR.gmo ro.gmo ru.gmo rw.gmo sv.gmo tr.gmo vi.gmo" || make da.gmo de.gmo es.gmo et.gmo fr.gmo ga.gmo hr.gmo id.gmo it.gmo ja.gmo ms.gmo nb.gmo nl.gmo pl.gmo pt_BR.gmo ro.gmo ru.gmo rw.gmo sv.gmo tr.gmo vi.gmo
make[3]: Entering directory `/home/neptunenavigator2001/bison-2.3/po'
: --update da.po bison.pot
rm -f da.gmo && : -c --statistics -o da.gmo da.po
mv: cannot stat `t-da.gmo': No such file or directory
make[3]: *** [da.gmo] Error 1
make[3]: Leaving directory `/home/neptunenavigator2001/bison-2.3/po'
make[2]: *** [stamp-po] Error 2
make[2]: Leaving directory `/home/neptunenavigator2001/bison-2.3/po'
make[1]: *** [all-recursive] Error 1
make[1]: Leaving directory `/home/neptunenavigator2001/bison-2.3'
make: *** [all] Error 2

It may be worth noting that I've already installed GNU M4 1.4. Thanks.
EDIT: I forgot to mention that I'm running Mandrakelinux 10.1.
EDIT 2: I also forgot to mention that I've also installed Perl5 8.8. I don't think that makes much of a difference, though.