Linux Help
guides forums blogs
Home Desktops Distributions ISO Images Logos Newbies Reviews Software Support & Resources Linuxhelp Wiki

Welcome Guest ( Log In | Register )



Advanced DNS Management
New ZoneEdit. New Managment.

FREE DNS Is Back

Sign Up Now
 
Reply to this topicStart new topic
> Mandrake 9.2 And Connexant Pci Adsl Card, have I installed the driver correctly?
black dog
post Feb 7 2004, 03:15 PM
Post #1


Whats this Lie-nix Thing?
*

Group: Members
Posts: 3
Joined: 7-February 04
Member No.: 2,320



Hi all,
I'm running Mandrake 9.2 and I have a connexant chipset PCI ADSL card. (It's a dynamode A220).

Dynamode don't do a Linux driver for it, but they pointed me at a site which has a fix, using generic Connexant Linux drivers.

http://patrick.spacesurfer.com/

Anyhow, I followed the instructions as per the site- not leaving anything out. I THINK everything's gone OK apart from the installation of the actual driver. I installed ATM on Linux and PPPoATM and that appeared to go fine- no error messages that I could see.

But the driver? Here's a dump from the console, any suggestions?

(apologies in advance, but I don't know which bit is relevent, so I copied it all).


**below was from /var/log/messages





Feb 7 19:17:17 localhost pppd[9881]: /usr/lib/pppd/plugins/pppoatm.so: cannot open shared object file: No such file or directory
Feb 7 19:17:17 localhost pppd[9881]: Couldn't load plugin /usr/lib/pppd/plugins/pppoatm.so





*****************
Below is what the console said when I tried to "make" the Connexant driver





[root@localhost adsl]# cd CnxADSL-6.1.2.007-PIM-1

[root@localhost CnxADSL-6.1.2.007-PIM-1]# make


for n in KernelModule/DpController;
do if [ -d $n ]; then make -C $n all || exit; fi; done
for n in KernelModule DownLoadApp; do make -C $n all || exit; done
make[1]: Entering directory `/usr/src/adsl/CnxADSL-6.1.2.007-PIM-1/KernelModule'
cc -D__KERNEL__ -DMODULE -DCPU=486 -march=i486 -DUTS_MACHINE='"i386"' -c -O2
-DNDIS_MINIPORT_DRIVER -DOS_LINUX -Wall -Wno-multichar -nostdinc -I PROJECT
_NAME_TIGRIS -I. -I../ -I/usr/src/linux/include -I/usr/src/linux/include/linux
-c -o ARMAbstract.o ARMAbstract.c
In file included from ARMAbstract.c:34:
LnxTools.h:39:26: linux/kernel.h: No such file or directory
LnxTools.h:40:26: linux/config.h: No such file or directory
LnxTools.h:41:26: linux/skbuff.h: No such file or directory
LnxTools.h:42:20: string.h: No such file or directory
LnxTools.h:43:19: delay.h: No such file or directory
LnxTools.h:45:27: linux/version.h: No such file or directory
LnxTools.h:46:40: missing binary operator before token "("
In file included from ARMAbstract.c:34:
LnxTools.h: In function `INIT_TIMER':
LnxTools.h:61: error: dereferencing pointer to incomplete type
LnxTools.h:62: error: dereferencing pointer to incomplete type
LnxTools.h:64: warning: implicit declaration of function `init_timer'
LnxTools.h: In function `CANCEL_TIMER':
LnxTools.h:71: warning: implicit declaration of function `del_timer'
LnxTools.h: In function `START_TIMER':
LnxTools.h:81: error: dereferencing pointer to incomplete type
LnxTools.h:81: error: `jiffies' undeclared (first use in this function)
LnxTools.h:81: error: (Each undeclared identifier is reported only once
LnxTools.h:81: error: for each function it appears in.)
LnxTools.h:81: error: `HZ' undeclared (first use in this function)
LnxTools.h:82: warning: implicit declaration of function `add_timer'
LnxTools.h: At top level:
LnxTools.h:88: error: syntax error before "SPIN_LOCK"
LnxTools.h:88: warning: type defaults to `int' in declaration of `SPIN_LOCK'
LnxTools.h:88: warning: data definition has no type or storage class
LnxTools.h:112: error: syntax error before "wait_queue_head_t"
LnxTools.h:112: warning: no semicolon at end of struct or union
LnxTools.h:113: warning: type defaults to `int' in declaration of `FlagLock'
LnxTools.h:113: warning: data definition has no type or storage class
LnxTools.h:114: warning: type defaults to `int' in declaration of `EVENT_HNDL'
LnxTools.h:114: warning: data definition has no type or storage class
LnxTools.h:116: error: syntax error before '*' token
LnxTools.h:117: error: syntax error before '*' token
LnxTools.h:118: error: syntax error before '*' token
LnxTools.h:119: error: syntax error before '*' token
LnxTools.h:120: error: syntax error before '*' token
LnxTools.h: In function `SLEEP':
LnxTools.h:128: error: `current' undeclared (first use in this function)
LnxTools.h:128: error: `TASK_INTERRUPTIBLE' undeclared (first use in this functi
on)
LnxTools.h:129: warning: implicit declaration of function `schedule_timeout'
LnxTools.h:129: error: `HZ' undeclared (first use in this function)
LnxTools.h: In function `MICRO_DELAY':
LnxTools.h:134: warning: implicit declaration of function `udelay'
LnxTools.h: In function `RemoveTailList':
LnxTools.h:162: error: `NULL' undeclared (first use in this function)
LnxTools.h: In function `RemoveHeadList':
LnxTools.h:178: error: `NULL' undeclared (first use in this function)
LnxTools.h: In function `RemoveListEntry':
LnxTools.h:197: error: `NULL' undeclared (first use in this function)
LnxTools.h: In function `ALLOCATE_MEMORY':
LnxTools.h:277: warning: implicit declaration of function `kmalloc'
LnxTools.h:277: error: `GFP_ATOMIC' undeclared (first use in this function)
LnxTools.h:277: warning: assignment makes pointer from integer without a cast
LnxTools.h:281: warning: implicit declaration of function `printk'
LnxTools.h:282: error: `ENOMEM' undeclared (first use in this function)
LnxTools.h: In function `FREE_MEMORY':
LnxTools.h:317: warning: implicit declaration of function `kfree'
ARMAbstract.c:35:19: delay.h: No such file or directory
In file included from ARMAbstract.c:43:
CnxADSL.h:33:26: linux/kernel.h: No such file or directory
CnxADSL.h:34:26: linux/config.h: No such file or directory
CnxADSL.h:35:23: linux/atm.h: No such file or directory
CnxADSL.h:37:26: linux/atmdev.h: No such file or directory
CnxADSL.h:38:23: linux/pci.h: No such file or directory
CnxADSL.h:39:26: linux/skbuff.h: No such file or directory
In file included from CnxADSL.h:41,
from ARMAbstract.c:43:
CardMgmt.h:37:26: linux/kernel.h: No such file or directory
CardMgmt.h:38:26: linux/config.h: No such file or directory
CardMgmt.h:39:23: linux/atm.h: No such file or directory
CardMgmt.h:41:26: linux/atmdev.h: No such file or directory
CardMgmt.h:42:23: linux/pci.h: No such file or directory
CardMgmt.h:43:26: linux/skbuff.h: No such file or directory
In file included from CardMgmt.h:48,
from CnxADSL.h:41,
from ARMAbstract.c:43:
UtilDbg.h:34:26: linux/kernel.h: No such file or directory
In file included from CnxADSL.h:41,
from ARMAbstract.c:43:
CardMgmt.h: At top level:
CardMgmt.h:115: error: field `NextBufferDes' has incomplete type
CardMgmt.h:310: error: syntax error before "SPIN_LOCK"
CardMgmt.h:310: warning: no semicolon at end of struct or union
CardMgmt.h:315: error: syntax error before "MainTimerStoppedEvent"
CardMgmt.h:315: warning: type defaults to `int' in declaration of `MainTimerStop
pedEvent'
CardMgmt.h:315: warning: data definition has no type or storage class
CardMgmt.h:361: error: syntax error before '}' token
CardMgmt.h:361: warning: type defaults to `int' in declaration of `CDSL_ADAPTER_
T'
CardMgmt.h:361: warning: data definition has no type or storage class
In file included from CardMgmt.h:363,
from CnxADSL.h:41,
from ARMAbstract.c:43:
CardAL.h:94: error: syntax error before '*' token
CardAL.h:149: error: syntax error before '*' token
CardAL.h:156: error: syntax error before '*' token
CardAL.h:163: error: syntax error before '*' token
CardAL.h:173: error: syntax error before '*' token
CardAL.h:183: error: syntax error before '*' token
CardAL.h:187: error: syntax error before '*' token
CardAL.h:189: error: syntax error before '*' token
CardAL.h:192: error: syntax error before '*' token
CardAL.h:215: error: syntax error before '*' token
CardAL.h:219: error: syntax error before '*' token
CardAL.h:225: error: syntax error before '*' token
CardAL.h:230: error: syntax error before '*' token
CardAL.h:234: error: syntax error before '*' token
CardAL.h:241: error: syntax error before '*' token
CardAL.h:246: error: syntax error before '*' token
CardAL.h:252: error: syntax error before '*' token
In file included from CardMgmt.h:365,
from CnxADSL.h:41,
from ARMAbstract.c:43:
FrameAL.h:288: error: field `FrameALTimer' has incomplete type
FrameAL.h:291: error: syntax error before "EVENT_HNDL"
FrameAL.h:291: warning: no semicolon at end of struct or union
FrameAL.h:296: error: syntax error before '}' token
FrameAL.h:296: warning: type defaults to `int' in declaration of `FRAMEAL_LINK_T
'
FrameAL.h:296: warning: data definition has no type or storage class
FrameAL.h:334: error: syntax error before '*' token
FrameAL.h:342: error: syntax error before '*' token
FrameAL.h:350: error: syntax error before '*' token
FrameAL.h:424: error: syntax error before '*' token
In file included from CellDataTest.h:23,
from CardMgmt.h:366,
from CnxADSL.h:41,
from ARMAbstract.c:43:
CellDataTestMgmt.h:53: error: field `TXCellRdyQ' has incomplete type
CellDataTestMgmt.h:56: error: field `TXCellInuseQ' has incomplete type
CellDataTestMgmt.h:74: error: field `RXCellRdyQ' has incomplete type
CellDataTestMgmt.h:77: error: field `RXCellInuseQ' has incomplete type
In file included from CardMgmt.h:366,
from CnxADSL.h:41,
from ARMAbstract.c:43:
CellDataTest.h:135: error: syntax error before '*' token
CellDataTest.h:143: error: syntax error before '*' token
CellDataTest.h:182: error: syntax error before '*' token
CellDataTest.h:190: error: syntax error before '*' token
CellDataTest.h:198: error: syntax error before '*' token
In file included from ChipALCdsl.h:137,
from CardMgmt.h:367,
from CnxADSL.h:41,
from ARMAbstract.c:43:
ChipALBusCtlP46.h:450: warning: declaration does not declare anything
ChipALBusCtlP46.h:482: warning: declaration does not declare anything
In file included from CardMgmt.h:367,
from CnxADSL.h:41,
from ARMAbstract.c:43:
ChipALCdsl.h:477: error: `EBUSY' undeclared here (not in a function)
ChipALCdsl.h:477: error: enumerator value for `CHIPAL_DEVICE_BUSY' not integer c
onstant
In file included from CardMgmt.h:367,
from CnxADSL.h:41,
from ARMAbstract.c:43:
ChipALCdsl.h:586: error: syntax error before '*' token
ChipALCdsl.h:593: error: syntax error before '*' token
ChipALCdsl.h:596: error: syntax error before '*' token
ChipALCdsl.h:603: warning: `struct pt_regs' declared inside parameter list
ChipALCdsl.h:603: warning: its scope is only this definition or declaration, whi
ch is probably not what you want
ChipALCdsl.h:608: error: syntax error before '*' token
ChipALCdsl.h:611: error: syntax error before '*' token
ChipALCdsl.h:614: error: syntax error before '*' token
ChipALCdsl.h:623: error: syntax error before '*' token
ChipALCdsl.h:630: error: syntax error before '*' token
ChipALCdsl.h:635: error: syntax error before '*' token
ChipALCdsl.h:638: error: syntax error before '*' token
ChipALCdsl.h:641: error: syntax error before '*' token
In file included from types.h:27,
from CardALTigrisHal.h:36,
from ChipALCdsl.h:749,
from CardMgmt.h:367,
from CnxADSL.h:41,
from ARMAbstract.c:43:
project.h:30:20: limits.h: No such file or directory
In file included from ChipALCdsl.h:749,
from CardMgmt.h:367,
from CnxADSL.h:41,
from ARMAbstract.c:43:
CardALTigrisHal.h:97: error: syntax error before '*' token
CardALTigrisHal.h:104: error: syntax error before '*' token
CardALTigrisHal.h:111: error: syntax error before '*' token
CardALTigrisHal.h:118: error: syntax error before '*' token
CardALTigrisHal.h:126: error: syntax error before '*' token
CardALTigrisHal.h:134: error: syntax error before '*' token
CardALTigrisHal.h:140: error: syntax error before '*' token
CardALTigrisHal.h:145: error: syntax error before '*' token
CardALTigrisHal.h:151: error: syntax error before '*' token
CardALTigrisHal.h:157: error: syntax error before '*' token
CardALTigrisHal.h:164: error: syntax error before '*' token
CardALTigrisHal.h:170: error: syntax error before '*' token
CardALTigrisHal.h:175: error: syntax error before '*' token
CardALTigrisHal.h:180: error: syntax error before '*' token
CardALTigrisHal.h:187: error: syntax error before '*' token
CardALTigrisHal.h:193: error: syntax error before '*' token
CardALTigrisHal.h:201: error: syntax error before '*' token
In file included from CardMgmt.h:367,
from CnxADSL.h:41,
from ARMAbstract.c:43:
ChipALCdsl.h:808: error: syntax error before '*' token
In file included from CardMgmt.h:368,
from CnxADSL.h:41,
from ARMAbstract.c:43:
BufMgmt.h:94: error: syntax error before '*' token
BufMgmt.h:102: error: syntax error before '*' token
BufMgmt.h:108: error: syntax error before '*' token
BufMgmt.h:113: error: syntax error before '*' token
BufMgmt.h:140: error: syntax error before '*' token
In file included from CnxADSL.h:41,
from ARMAbstract.c:43:
CardMgmt.h:386: error: syntax error before '*' token
CardMgmt.h:390: error: syntax error before '*' token
In file included from ARMAbstract.c:43:
CnxADSL.h:58: error: syntax error before '*' token
CnxADSL.h:58: warning: type defaults to `int' in declaration of `gpAdapterList'
CnxADSL.h:58: warning: data definition has no type or storage class
CnxADSL.h:148: warning: `struct atm_qos' declared inside parameter list
CnxADSL.h:158: error: syntax error before "loff_t"
In file included from ChipALSEmw.h:50,
from ChipALCdslV.h:18,
from ARMAbstract.c:46:
SmSysIf.h:434: warning: declaration does not declare anything
In file included from ARMAbstract.c:46:
ChipALCdslV.h:260: error: syntax error before '*' token
ChipALCdslV.h:266: error: syntax error before '*' token
ChipALCdslV.h:271: error: syntax error before '*' token
In file included from ChipALCdslV.h:346,
from ARMAbstract.c:46:
ChipALBusCtlP46V.h:89: error: syntax error before '*' token
ChipALBusCtlP46V.h:94: error: syntax error before '*' token
ChipALBusCtlP46V.h:123: error: syntax error before "CDSL_ADAPTER_T"
ChipALBusCtlP46V.h:126: error: syntax error before '*' token
ChipALBusCtlP46V.h:130: error: syntax error before '*' token
In file included from ChipALCdslV.h:347,
from ARMAbstract.c:46:
CardALTigrisHalV.h:40:24: asm/atomic.h: No such file or directory
In file included from ChipALCdslV.h:347,
from ARMAbstract.c:46:
CardALTigrisHalV.h:478: error: syntax error before '*' token
In file included from ARMAbstract.c:46:
ChipALCdslV.h:415: error: syntax error before "SPIN_LOCK"
ChipALCdslV.h:415: warning: no semicolon at end of struct or union
ChipALCdslV.h:454: error: syntax error before '}' token
ChipALCdslV.h:454: warning: type defaults to `int' in declaration of `HW_CH_ENTR
Y_T'
ChipALCdslV.h:454: warning: data definition has no type or storage class
ChipALCdslV.h:461: error: syntax error before '*' token
ChipALCdslV.h:464: error: syntax error before "HW_CH_ENTRY_T"
ChipALCdslV.h:465: warning: type defaults to `int' in declaration of `FN_DMA_OPE
N_HANDLER_T'
ChipALCdslV.h:465: warning: data definition has no type or storage class
ChipALCdslV.h:469: error: syntax error before '*' token
ChipALCdslV.h:473: error: syntax error before '*' token
ChipALCdslV.h:477: error: syntax error before '*' token
ChipALCdslV.h:482: error: syntax error before '*' token
ChipALCdslV.h:487: error: syntax error before '*' token
ChipALCdslV.h:493: error: syntax error before '*' token
ChipALCdslV.h:499: error: syntax error before "FN_DMA_OPEN_HANDLER_T"
ChipALCdslV.h:499: warning: no semicolon at end of struct or union
ChipALCdslV.h:508: error: syntax error before '}' token
ChipALCdslV.h:508: warning: type defaults to `int' in declaration of `DMA_CONTRO
L_T'
ChipALCdslV.h:508: warning: data definition has no type or storage class
In file included from ChipALCdslV.h:511,
from ARMAbstract.c:46:
ChipALDmaChanP46.h:69: error: syntax error before '*' token
ChipALDmaChanP46.h:74: error: syntax error before '*' token
ChipALDmaChanP46.h:145: error: syntax error before "DmaChanP46"
ChipALDmaChanP46.h:145: warning: type defaults to `int' in declaration of `DmaCh
anP46'
ChipALDmaChanP46.h:145: warning: data definition has no type or storage class
In file included from ARMAbstract.c:46:
ChipALCdslV.h:543: error: syntax error before "CDSL_ADAPTER_T"
ChipALCdslV.h:543: warning: no semicolon at end of struct or union
ChipALCdslV.h:546: error: syntax error before '*' token
ChipALCdslV.h:546: warning: type defaults to `int' in declaration of `DmaControl
'
ChipALCdslV.h:546: warning: data definition has no type or storage class
ChipALCdslV.h:549: error: syntax error before '*' token
ChipALCdslV.h:549: warning: type defaults to `int' in declaration of `DmaChannel
'
ChipALCdslV.h:549: warning: data definition has no type or storage class
ChipALCdslV.h:556: error: syntax error before "RegIoLock"
ChipALCdslV.h:556: warning: type defaults to `int' in declaration of `RegIoLock'
ChipALCdslV.h:556: warning: data definition has no type or storage class
ChipALCdslV.h:565: error: syntax error before "IsrLock"
ChipALCdslV.h:565: warning: type defaults to `int' in declaration of `IsrLock'
ChipALCdslV.h:565: warning: data definition has no type or storage class
ChipALCdslV.h:574: error: syntax error before "CalTimerStoppedEvent"
ChipALCdslV.h:574: warning: type defaults to `int' in declaration of `CalTimerSt
oppedEvent'
ChipALCdslV.h:574: warning: data definition has no type or storage class
ChipALCdslV.h:577: warning: type defaults to `int' in declaration of `CHIPAL_T'
ChipALCdslV.h:577: warning: data definition has no type or storage class
ChipALCdslV.h:593: error: syntax error before "CHIPAL_T"
ChipALCdslV.h:593: warning: no semicolon at end of struct or union
ChipALCdslV.h:600: error: syntax error before '}' token
ChipALCdslV.h:600: warning: type defaults to `int' in declaration of `CAL_CRITIC
AL_CONTEXT_S'
ChipALCdslV.h:600: warning: data definition has no type or storage class
In file included from ARMAbstract.c:48:
ARMAbstract.h:44: error: syntax error before '*' token
ARMAbstract.h:50: error: syntax error before '*' token
ARMAbstract.h:55: error: syntax error before '*' token
ARMAbstract.h:60: error: syntax error before '*' token
ARMAbstract.h:67: error: syntax error before '*' token
ARMAbstract.c:74: error: syntax error before "CDSL_ADAPTER_T"
ARMAbstract.c:74: warning: no semicolon at end of struct or union
ARMAbstract.c:76: error: syntax error before '*' token
ARMAbstract.c:76: warning: type defaults to `int' in declaration of `pEvent'
ARMAbstract.c:76: warning: data definition has no type or storage class
ARMAbstract.c:77: error: syntax error before '}' token
ARMAbstract.c:77: warning: type defaults to `int' in declaration of `ARM_ASYC_IO
_T'
ARMAbstract.c:77: warning: data definition has no type or storage class
ARMAbstract.c:93: error: syntax error before '*' token
ARMAbstract.c:107: error: syntax error before '*' token
ARMAbstract.c:112: error: syntax error before '*' token
ARMAbstract.c:118: error: syntax error before '*' token
ARMAbstract.c:146: error: syntax error before '*' token
ARMAbstract.c: In function `ARMALCfgInit':
ARMAbstract.c:158: error: `pThisAdapter' undeclared (first use in this function)
ARMAbstract.c: At top level:
ARMAbstract.c:199: error: syntax error before '*' token
ARMAbstract.c:233: error: syntax error before '*' token
ARMAbstract.c: In function `printl':
ARMAbstract.c:256: error: `va_list' undeclared (first use in this function)
ARMAbstract.c:256: error: syntax error before "va_ptr"
ARMAbstract.c:259: warning: implicit declaration of function `va_start'
ARMAbstract.c:259: error: `va_ptr' undeclared (first use in this function)
ARMAbstract.c:274: warning: implicit declaration of function `va_arg'
ARMAbstract.c:274: error: syntax error before "DWORD"
ARMAbstract.c:281: warning: implicit declaration of function `va_end'
ARMAbstract.c: In function `Log_Copy_String':
ARMAbstract.c:346: warning: implicit declaration of function `strncat'
ARMAbstract.c:349: warning: implicit declaration of function `strlen'
ARMAbstract.c: At top level:
ARMAbstract.c:585: error: syntax error before '*' token
ARMAbstract.c: In function `ARMALIoctl':
ARMAbstract.c:593: error: `Command' undeclared (first use in this function)
ARMAbstract.c:595: warning: implicit declaration of function `_IOW'
ARMAbstract.c:595: error: syntax error before "struct"
ARMAbstract.c:600: error: `pDesc' undeclared (first use in this function)
ARMAbstract.c:605: error: syntax error before "struct"
ARMAbstract.c:610: warning: implicit declaration of function `memset'
ARMAbstract.c:590: warning: unused variable `Status'
ARMAbstract.c:600: warning: unreachable code at beginning of switch statement
ARMAbstract.c:614: error: break statement not within loop or switch
ARMAbstract.c: At top level:
ARMAbstract.c:617: error: syntax error before "case"
ARMAbstract.c:628: warning: type defaults to `int' in declaration of `ARMIsComma
ndSetLoaded'
ARMAbstract.c:628: warning: parameter names (without types) in function declarat
ion
ARMAbstract.c:628: error: conflicting types for `ARMIsCommandSetLoaded'
ARMAbstract.h:68: error: previous declaration of `ARMIsCommandSetLoaded'
ARMAbstract.c:628: warning: data definition has no type or storage class
ARMAbstract.c:630: error: syntax error before "if"
ARMAbstract.c:649: warning: type defaults to `int' in declaration of `Status'
ARMAbstract.c:649: error: `EBADFD' undeclared here (not in a function)
ARMAbstract.c:649: warning: data definition has no type or storage class
ARMAbstract.c:650: error: syntax error before "break"
ARMAbstract.c:676: error: syntax error before '.' token
ARMAbstract.c:679: warning: type defaults to `int' in declaration of `Status'
ARMAbstract.c:679: error: redefinition of `Status'
ARMAbstract.c:649: error: `Status' previously defined here
ARMAbstract.c:687: error: `pThisAdapter' undeclared here (not in a function)
ARMAbstract.c:687: error: `pThisAdapter' undeclared here (not in a function)
ARMAbstract.c:687: error: `ArmCommand' undeclared here (not in a function)
ARMAbstract.c:687: warning: data definition has no type or storage class
ARMAbstract.c:692: error: syntax error before '}' token
ARMAbstract.c:699: warning: type defaults to `int' in declaration of `Status'
ARMAbstract.c:699: error: redefinition of `Status'
ARMAbstract.c:679: error: `Status' previously defined here
ARMAbstract.c:699: warning: data definition has no type or storage class
ARMAbstract.c:700: error: syntax error before '}' token
ARMAbstract.c:716: warning: type defaults to `int' in declaration of `Status'
ARMAbstract.c:716: error: redefinition of `Status'
ARMAbstract.c:699: error: `Status' previously defined here
ARMAbstract.c:716: error: `EBADFD' undeclared here (not in a function)
ARMAbstract.c:716: warning: data definition has no type or storage class
ARMAbstract.c:717: error: syntax error before "break"
ARMAbstract.c:774: error: syntax error before '*' token
ARMAbstract.c:775: error: conflicting types for `ARMIsCommandSetLoaded'
ARMAbstract.c:628: error: previous declaration of `ARMIsCommandSetLoaded'
ARMAbstract.c: In function `ARMIsCommandSetLoaded':
ARMAbstract.c:780: error: syntax error before "CompletionEvent"
ARMAbstract.c:781: error: syntax error before "ArmSync"
ARMAbstract.c:789: error: `CompletionEvent' undeclared (first use in this functi
on)
ARMAbstract.c:792: error: `ArmSync' undeclared (first use in this function)
ARMAbstract.c:792: error: `pThisAdapter' undeclared (first use in this function)
ARMAbstract.c: In function `ARMSyncRoutine':
ARMAbstract.c:902: error: syntax error before ')' token
ARMAbstract.c:905: error: syntax error before ')' token
ARMAbstract.c: At top level:
ARMAbstract.c:940: error: syntax error before '*' token
ARMAbstract.c: In function `processDataRec':
ARMAbstract.c:951: error: syntax error before "CompletionEvent"
ARMAbstract.c:962: error: `CompletionEvent' undeclared (first use in this functi
on)
ARMAbstract.c:965: error: `cInRec' undeclared (first use in this function)
ARMAbstract.c:968: error: `uExtAddr' undeclared (first use in this function)
ARMAbstract.c:987: error: `pThisAdapter' undeclared (first use in this function)
ARMAbstract.c: In function `ARMALP46CompletionRoutine':
ARMAbstract.c:1068: error: `Event' undeclared (first use in this function)
ARMAbstract.c: At top level:
ARMAbstract.c:1173: error: syntax error before '*' token
ARMAbstract.c: In function `ARMALStartArm':
ARMAbstract.c:1184: error: syntax error before "CompletionEvent"
ARMAbstract.c:1185: error: syntax error before "ArmSync"
ARMAbstract.c:1192: error: `CompletionEvent' undeclared (first use in this funct
ion)
ARMAbstract.c:1194: error: `ArmSync' undeclared (first use in this function)
ARMAbstract.c:1194: error: `pThisAdapter' undeclared (first use in this function
)
ARMAbstract.c: At top level:
ARMAbstract.c:1500: error: syntax error before '*' token
ARMAbstract.c: In function `ARMALInitIo':
ARMAbstract.c:1507: error: syntax error before "CompletionEvent"
ARMAbstract.c:1522: error: `pThisAdapter' undeclared (first use in this function
)
ARMAbstract.c:1574: error: `CompletionEvent' undeclared (first use in this funct ion)
ARMAbstract.c: At top level:
ARMAbstract.c:1649: error: syntax error before '*' token
ARMAbstract.c: In function `ARMALNotifyArmReady':
ARMAbstract.c:1655: error: syntax error before "CompletionEvent"
ARMAbstract.c:1656: error: syntax error before "ArmSync"
ARMAbstract.c:1664: error: `CompletionEvent' undeclared (first use in this funct ion)
ARMAbstract.c:1666: error: `ArmSync' undeclared (first use in this function)
ARMAbstract.c:1666: error: `pThisAdapter' undeclared (first use in this function )
ARMAbstract.c: At top level:
CardMgmt.h:313: error: storage size of `MainTimer' isn't known
CardMgmt.h:354: error: storage size of `DSLInterruptQueStr' isn't known
CardMgmt.h:355: error: storage size of `ARMInterruptQueStr' isn't known
CardMgmt.h:358: error: storage size of `PGBkgndQueStr' isn't known
CardMgmt.h:359: error: storage size of `PGBkgndTimerStr' isn't known
CardMgmt.h:360: error: storage size of `SITaskQueStr' isn't known
ChipALCdslV.h:572: error: storage size of `CalTimer' isn't known
make[1]: *** [ARMAbstract.o] Error 1
make[1]: Leaving directory `/usr/src/adsl/CnxADSL-6.1.2.007-PIM-1/KernelModule'
make: *** [all] Error 2
[root@localhost CnxADSL-6.1.2.007-PIM-1]#
[root@localhost CnxADSL-6.1.2.007-PIM-1]#




Please accept my apologies, but I'm new to linux and don't really know which bit you'd need to know.

Any help or suggestions gratefully recieved:)
Black Dog
Go to the top of the page
 
+Quote Post

Reply to this topicStart new topic
1 User(s) are reading this topic (1 Guests and 0 Anonymous Users)
0 Members:

 



RSS Lo-Fi Version Time is now: 19th October 2017 - 04:12 AM